Reaction Details
TargetBcl-2-like protein 1
LigandBDBM185598
Substrate/Competitorn/a
Meas. Tech.Time Resolved-Fluorescence Resonance Energy Transfer (TR-FRET) Assay
Temperature298.15±n/a K
Ki 0.064±n/a nM
Commentsextracted
Citation Kunzer, ARElmore, SWHexamer, LAPark, CSouers, AJSullivan, GMWang, GTWang, XWendt, MD Apoptosis-inducing agents for the treatment of cancer and immune and autoimmune diseases US Patent US9156856 Publication Date 10/13/2015
 
Bcl-2-like protein 1
Name:Bcl-2-like protein 1
Type:Mitochondrion membrane; Single-pass membrane protein
Mol. Mass.:26039.60
Organism:Homo sapiens (Human)
Description:n/a
Residue:233
BDBM185598
NameBDBM185598
Synonyms:US9156856, 8 | US9493431, 8
TypeSmall organic molecule
Emp. Form.C42H51ClN6O5S3
Mol. Mass.851.54
SMILESCC(C)N(C)CC[C@H](CSc1ccccc1)Nc1sc(cc1[N+]([O-])=O)S(=O)(=O)NC(=O)c1ccc(cc1)N1CCN(CC2=C(CCCC2)c2ccc(Cl)cc2)CC1