Reaction Details
TargetProtein-glutamine gamma-glutamyltransferase 2
LigandBDBM185773
Substrate/Competitorn/a
Meas. Tech.Enzyme Inhibition Assay
IC50>100000±n/a nM
Citation Pardin, CKeillor, JWLubell, WD Cinnamoyl inhibitors of transglutaminase US Patent US9162991 Publication Date 10/20/2015
 
Protein-glutamine gamma-glutamyltransferase 2
Name:Protein-glutamine gamma-glutamyltransferase 2
Type:Enzyme
Mol. Mass.:77122.36
Organism:Cavia cutleri (Guinea pig)
Description:P08587
Residue:690
BDBM185773
NameBDBM185773
Synonyms:US9162991, 15e
TypeSmall organic molecule
Emp. Form.C16H13N3O2
Mol. Mass.279.2933
SMILESCOc1cccc(\C=C\C(=O)n2nnc3ccccc23)c1