Reaction Details
TargetProtein-glutamine gamma-glutamyltransferase 2
LigandBDBM185785
Substrate/Competitorn/a
Meas. Tech.Enzyme Inhibition Assay
IC50 21000±4000 nM
Citation Pardin, CKeillor, JWLubell, WD Cinnamoyl inhibitors of transglutaminase US Patent US9162991 Publication Date 10/20/2015
 
Protein-glutamine gamma-glutamyltransferase 2
Name:Protein-glutamine gamma-glutamyltransferase 2
Type:Enzyme
Mol. Mass.:77122.36
Organism:Cavia cutleri (Guinea pig)
Description:P08587
Residue:690
BDBM185785
NameBDBM185785
Synonyms:US9162991, 30a
TypeSmall organic molecule
Emp. Form.C14H10N2O3
Mol. Mass.254.2408
SMILESO=C(\C=C\c1ccc(cc1)N(=O)=O)c1cccnc1