Reaction Details
TargetProtein-glutamine gamma-glutamyltransferase 2
LigandBDBM185786
Substrate/Competitorn/a
Meas. Tech.Enzyme Inhibition Assay
IC50 148000±27000 nM
Citation Pardin, CKeillor, JWLubell, WD Cinnamoyl inhibitors of transglutaminase US Patent US9162991 Publication Date 10/20/2015
 
Protein-glutamine gamma-glutamyltransferase 2
Name:Protein-glutamine gamma-glutamyltransferase 2
Type:Enzyme
Mol. Mass.:77122.36
Organism:Cavia cutleri (Guinea pig)
Description:P08587
Residue:690
BDBM185786
NameBDBM185786
Synonyms:US9162991, 30r
TypeSmall organic molecule
Emp. Form.C14H12N2O
Mol. Mass.224.2579
SMILESNc1ccc(\C=C\C(=O)c2cccnc2)cc1