Reaction Details
TargetProtein-glutamine gamma-glutamyltransferase 2
LigandBDBM185740
Substrate/Competitorn/a
Meas. Tech.Enzyme Inhibition Assay
IC50>20000±n/a nM
Citation Pardin, CKeillor, JWLubell, WD Cinnamoyl inhibitors of transglutaminase US Patent US9162991 Publication Date 10/20/2015
 
Protein-glutamine gamma-glutamyltransferase 2
Name:Protein-glutamine gamma-glutamyltransferase 2
Type:Enzyme
Mol. Mass.:77122.36
Organism:Cavia cutleri (Guinea pig)
Description:P08587
Residue:690
BDBM185740
NameBDBM185740
Synonyms:US9162991, 14a
TypeSmall organic molecule
Emp. Form.C15H10N4O4
Mol. Mass.310.2643
SMILES[O-]n1n[n+](C(=O)\C=C\c2ccc(cc2)[N+]([O-])=O)c2ccccc12