Reaction Details
TargetProtein-glutamine gamma-glutamyltransferase 2
LigandBDBM185749
Substrate/Competitorn/a
Meas. Tech.Enzyme Inhibition Assay
IC50>200000±n/a nM
Citation Pardin, CKeillor, JWLubell, WD Cinnamoyl inhibitors of transglutaminase US Patent US9162991 Publication Date 10/20/2015
 
Protein-glutamine gamma-glutamyltransferase 2
Name:Protein-glutamine gamma-glutamyltransferase 2
Type:Enzyme
Mol. Mass.:77122.36
Organism:Cavia cutleri (Guinea pig)
Description:P08587
Residue:690
BDBM185749
NameBDBM185749
Synonyms:US9162991, 25a
TypeSmall organic molecule
Emp. Form.C17H14N2O3
Mol. Mass.294.3047
SMILES[O-][N+](=O)c1ccc(\C=C\C(=O)N2CCc3ccccc23)cc1