Reaction Details
TargetProtein-glutamine gamma-glutamyltransferase 2
LigandBDBM185751
Substrate/Competitorn/a
Meas. Tech.Enzyme Inhibition Assay
IC50>200000±n/a nM
Citation Pardin, CKeillor, JWLubell, WD Cinnamoyl inhibitors of transglutaminase US Patent US9162991 Publication Date 10/20/2015
 
Protein-glutamine gamma-glutamyltransferase 2
Name:Protein-glutamine gamma-glutamyltransferase 2
Type:Enzyme
Mol. Mass.:77122.36
Organism:Cavia cutleri (Guinea pig)
Description:P08587
Residue:690
BDBM185751
NameBDBM185751
Synonyms:US9162991, 27a
TypeSmall organic molecule
Emp. Form.C17H16N2O3
Mol. Mass.296.3205
SMILESCN(Cc1ccccc1)C(=O)\C=C\c1ccc(cc1)[N+]([O-])=O