Reaction Details
TargetProtein-glutamine gamma-glutamyltransferase 2
LigandBDBM185756
Substrate/Competitorn/a
Meas. Tech.Enzyme Inhibition Assay
IC50 28500±2400 nM
Citation Pardin, CKeillor, JWLubell, WD Cinnamoyl inhibitors of transglutaminase US Patent US9162991 Publication Date 10/20/2015
 
Protein-glutamine gamma-glutamyltransferase 2
Name:Protein-glutamine gamma-glutamyltransferase 2
Type:Enzyme
Mol. Mass.:77122.36
Organism:Cavia cutleri (Guinea pig)
Description:P08587
Residue:690
BDBM185756
NameBDBM185756
Synonyms:US9162991, 4b
TypeSmall organic molecule
Emp. Form.C19H24N4O3
Mol. Mass.356.4189
SMILESCCCCCCCCn1cc(nn1)C(=O)\C=C\c1ccc(cc1)N(=O)=O