Reaction Details
TargetProtein-glutamine gamma-glutamyltransferase 2
LigandBDBM185757
Substrate/Competitorn/a
Meas. Tech.Enzyme Inhibition Assay
IC50>100000±n/a nM
Citation Pardin, CKeillor, JWLubell, WD Cinnamoyl inhibitors of transglutaminase US Patent US9162991 Publication Date 10/20/2015
 
Protein-glutamine gamma-glutamyltransferase 2
Name:Protein-glutamine gamma-glutamyltransferase 2
Type:Enzyme
Mol. Mass.:77122.36
Organism:Cavia cutleri (Guinea pig)
Description:P08587
Residue:690
BDBM185757
NameBDBM185757
Synonyms:US9162991, 4c
TypeSmall organic molecule
Emp. Form.C16H16N4O3
Mol. Mass.312.3232
SMILESO=C(\C=C\c1ccc(cc1)N(=O)=O)c1cn(nn1)C1CCCC1