Reaction Details
Target5-hydroxytryptamine receptor 2A
LigandBDBM186935
Substrate/Competitorn/a
Meas. Tech.Radioligand Binding Assay
pH7.4±n/a
Ki 1275±n/a nM
Commentsextracted
Citation Besnard, JHopkins, ALGilbert, IRuda, GFAbecassis, K Morpholino compounds, uses and methods US Patent US9079895 Publication Date 7/14/2015
 
5-hydroxytryptamine receptor 2A
Name:5-hydroxytryptamine receptor 2A
Type:Enzyme
Mol. Mass.:52843.00
Organism:Mus musculus (Mouse)
Description:P35363
Residue:471
BDBM186935
NameBDBM186935
Synonyms:US9079895, 23s
TypeSmall organic molecule
Emp. Form.C21H25ClN2O2
Mol. Mass.372.888
SMILESClc1cccc(OC[C@@H]2CN(CCN3CCc4ccccc34)CCO2)c1