Reaction Details
Target5-hydroxytryptamine receptor 2B
LigandBDBM186932
Substrate/Competitorn/a
Meas. Tech.Radioligand Binding Assay
pH7.4±n/a
Ki 2358±n/a nM
Commentsextracted
Citation Besnard, JHopkins, ALGilbert, IRuda, GFAbecassis, K Morpholino compounds, uses and methods US Patent US9079895 Publication Date 7/14/2015
 
5-hydroxytryptamine receptor 2B
Name:5-hydroxytryptamine receptor 2B
Type:Enzyme
Mol. Mass.:53610.91
Organism:Mus musculus (Mouse)
Description:Q02152
Residue:479
BDBM186932
NameBDBM186932
Synonyms:US9079895, 22r
TypeSmall organic molecule
Emp. Form.C21H23ClN2O3
Mol. Mass.386.872
SMILESClc1cccc(OC[C@H]2CN(CC(=O)N3CCc4ccccc34)CCO2)c1