Reaction Details
Target5-hydroxytryptamine receptor 2B
LigandBDBM186960
Substrate/Competitorn/a
Meas. Tech.Radioligand Binding Assay
pH7.4±n/a
Ki 5179±n/a nM
Commentsextracted
Citation Besnard, JHopkins, ALGilbert, IRuda, GFAbecassis, K Morpholino compounds, uses and methods US Patent US9079895 Publication Date 7/14/2015
 
5-hydroxytryptamine receptor 2B
Name:5-hydroxytryptamine receptor 2B
Type:Enzyme
Mol. Mass.:53610.91
Organism:Mus musculus (Mouse)
Description:Q02152
Residue:479
BDBM186960
NameBDBM186960
Synonyms:US9079895, 62
TypeSmall organic molecule
Emp. Form.C22H27N3O3
Mol. Mass.381.4681
SMILESCC1Cc2ccccc2N1C(=O)CN1CCO[C@@H](COc2cccnc2C)C1