Reaction Details
Target5-hydroxytryptamine receptor 2B
LigandBDBM186962
Substrate/Competitorn/a
Meas. Tech.Radioligand Binding Assay
pH7.4±n/a
Ki 441±n/a nM
Commentsextracted
Citation Besnard, JHopkins, ALGilbert, IRuda, GFAbecassis, K Morpholino compounds, uses and methods US Patent US9079895 Publication Date 7/14/2015
 
5-hydroxytryptamine receptor 2B
Name:5-hydroxytryptamine receptor 2B
Type:Enzyme
Mol. Mass.:53610.91
Organism:Mus musculus (Mouse)
Description:Q02152
Residue:479
BDBM186962
NameBDBM186962
Synonyms:US9079895, 64
TypeSmall organic molecule
Emp. Form.C22H25ClN2O3
Mol. Mass.400.899
SMILESCC1Cc2ccccc2N1C(=O)CN1CCO[C@H](COc2cccc(Cl)c2)C1