Reaction Details
TargetAlpha-1D adrenergic receptor
LigandBDBM186937
Substrate/Competitorn/a
Meas. Tech.Radioligand Binding Assay
pH7.4±n/a
Ki 6448±n/a nM
Commentsextracted
Citation Besnard, JHopkins, ALGilbert, IRuda, GFAbecassis, K Morpholino compounds, uses and methods US Patent US9079895 Publication Date 7/14/2015
 
Alpha-1D adrenergic receptor
Name:Alpha-1D adrenergic receptor
Type:Enzyme
Mol. Mass.:59890.14
Organism:Mus musculus (Mouse)
Description:P97714
Residue:562
BDBM186937
NameBDBM186937
Synonyms:US9079895, 25s
TypeSmall organic molecule
Emp. Form.C22H28N2O3
Mol. Mass.368.4693
SMILESCOc1cccc(OC[C@@H]2CN(CCN3CCc4ccccc34)CCO2)c1