Reaction Details
TargetBromodomain-containing protein 4
LigandBDBM188517
Substrate/Competitorn/a
Meas. Tech.ITC
Kd>2.0e+4±n/a nM
Citation Chekler, ELPellegrino, JALanz, TADenny, RAFlick, ACCoe, JLangille, JBasak, ALiu, SStock, IASahasrabudhe, PBonin, PDLee, KPletcher, MTJones, LH Transcriptional Profiling of a Selective CREB Binding Protein Bromodomain Inhibitor Highlights Therapeutic Opportunities. Chem Biol22:1588-96 (2015) 
 
Bromodomain-containing protein 4
Name:Bromodomain-containing protein 4
Type:Protein
Mol. Mass.:152264.84
Organism:Homo sapiens (Human)
Description:O60885
Residue:1362
BDBM188517
NameBDBM188517
Synonyms:PF-CBP1
TypeSmall organic molecule
Emp. Form.C29H36N4O3
Mol. Mass.488.6211
SMILESCCCOc1ccc(CCc2nc3cc(ccc3n2CCN2CCOCC2)-c2c(C)noc2C)cc1