Reaction Details
TargetDual 3',5'-cyclic-AMP and -GMP phosphodiesterase 11A
LigandBDBM189315
Substrate/Competitorn/a
Meas. Tech.In Vitro Enzyme Assay
IC50<200±n/a nM
Citation Hoffman, CSCeyhan, O Inhibitors of phosphodiesterase 11 (PDE11) US Patent US9173884 Publication Date 11/3/2015
 
Dual 3',5'-cyclic-AMP and -GMP phosphodiesterase 11A
Name:Dual 3',5'-cyclic-AMP and -GMP phosphodiesterase 11A
Type:Enzyme
Mol. Mass.:104751.53
Organism:Homo sapiens (Human)
Description:Q9HCR9
Residue:933
BDBM189315
NameBDBM189315
Synonyms:US9173884, BC11-28-5
TypeSmall organic molecule
Emp. Form.C24H18N4
Mol. Mass.362.4265
SMILESN(c1ccccc1)c1ncnc2n(cc(-c3ccccc3)c12)-c1ccccc1