Reaction Details
TargetKinesin-like protein KIF11 [15-368]
LigandBDBM189359
Substrate/Competitorn/a
Meas. Tech.ADP Hunter Plus Assay
pH7±n/a
Temperature298.15±n/a K
IC50 6.5e+4±n/a nM
Commentsextracted
Citation Zhang, WZhai, LLu, WBoohaker, RJPadmalayam, ILi, Y Discovery of Novel Allosteric Eg5 Inhibitors Through Structure-Based Virtual Screening. Chem Biol Drug Des88:178-87 (2016) 
 
Kinesin-like protein KIF11 [15-368]
Name:Kinesin-like protein KIF11 [15-368]
Type:Protein
Mol. Mass.:39484.97
Organism:Homo sapiens (Human)
Description:Eg5 motor domain (15-368aa)
Residue:354
BDBM189359
NameBDBM189359
Synonyms:SRI35566
TypeSmall organic molecule
Emp. Form.C14H11N5O2
Mol. Mass.281.2694
SMILESO=C1CC(c2ccccc2)c2c(N1)n1ncnc1[nH]c2=O