Reaction Details
TargetAcetylcholinesterase
LigandBDBM189362
Substrate/Competitorn/a
Meas. Tech.AChE Inhibitory Assay
pH7.7±n/a
IC50 415±30.44 nM
Commentsextracted
Citation Shaik, JBPalaka, BKPenumala, MEadlapalli, SDarla Mark, MAmpasala, DRVadde, RAmooru Gangaiah, D Synthesis, Biological Evaluation, and Molecular Docking of 8-imino-2-oxo-2H,8H-pyrano[2,3-f]chromene Analogs: New Dual AChE Inhibitors as Potential Drugs for the Treatment of Alzheimer's Disease. Chem Biol Drug Des88:43-53 (2016) 
 
Acetylcholinesterase
Name:Acetylcholinesterase
Type:Enzyme
Mol. Mass.:71812.79
Organism:Electrophorus electricus (Electric eel)
Description:n/a
Residue:633
BDBM189362
NameBDBM189362
Synonyms:8-imino-N-methyl-2-oxo-2H,8H-pyrano[2,3-f]chromene-9-carboxamide (4a)
TypeSmall organic molecule
Emp. Form.C14H10N2O4
Mol. Mass.270.2402
SMILESCNC(=O)c1cc2c(ccc3ccc(=O)oc23)oc1=N