Reaction Details
TargetAcetylcholinesterase
LigandBDBM189367
Substrate/Competitorn/a
Meas. Tech.AChE Inhibitory Assay
pH7.7±n/a
IC50 226±16.74 nM
Commentsextracted
Citation Shaik, JBPalaka, BKPenumala, MEadlapalli, SDarla Mark, MAmpasala, DRVadde, RAmooru Gangaiah, D Synthesis, Biological Evaluation, and Molecular Docking of 8-imino-2-oxo-2H,8H-pyrano[2,3-f]chromene Analogs: New Dual AChE Inhibitors as Potential Drugs for the Treatment of Alzheimer's Disease. Chem Biol Drug Des88:43-53 (2016) 
 
Acetylcholinesterase
Name:Acetylcholinesterase
Type:Enzyme
Mol. Mass.:71812.79
Organism:Electrophorus electricus (Electric eel)
Description:n/a
Residue:633
BDBM189367
NameBDBM189367
Synonyms:8-imino-9-(morpholine-4-carbonyl)-2H,8H-pyrano[2,3-f]chromen-2-one (4f)
TypeSmall organic molecule
Emp. Form.C17H14N2O5
Mol. Mass.326.3035
SMILESN=c1oc2ccc3ccc(=O)oc3c2cc1C(=O)N1CCOCC1