Reaction Details
TargetAcetylcholinesterase
LigandBDBM189368
Substrate/Competitorn/a
Meas. Tech.AChE Inhibitory Assay
pH7.7±n/a
IC50 497±40.50 nM
Commentsextracted
Citation Shaik, JBPalaka, BKPenumala, MEadlapalli, SDarla Mark, MAmpasala, DRVadde, RAmooru Gangaiah, D Synthesis, Biological Evaluation, and Molecular Docking of 8-imino-2-oxo-2H,8H-pyrano[2,3-f]chromene Analogs: New Dual AChE Inhibitors as Potential Drugs for the Treatment of Alzheimer's Disease. Chem Biol Drug Des88:43-53 (2016) 
 
Acetylcholinesterase
Name:Acetylcholinesterase
Type:Enzyme
Mol. Mass.:71812.79
Organism:Electrophorus electricus (Electric eel)
Description:n/a
Residue:633
BDBM189368
NameBDBM189368
Synonyms:N-benzyl-8-imino-2-oxo-2H,8H-pyrano[2,3-f]chromene-9-carboxamide (4g)
TypeSmall organic molecule
Emp. Form.C20H14N2O4
Mol. Mass.346.3362
SMILESN=c1oc2ccc3ccc(=O)oc3c2cc1C(=O)NCc1ccccc1