Reaction Details
TargetCoagulation factor VII
LigandBDBM189430
Substrate/Competitorn/a
Meas. Tech.In Vitro Assay
Ki 0.55±n/a nM
Citation Zhang, XGlunz, PPriestley, ESJohnson, JAWurtz, NRLadziata, V Macrocyclic factor VIIa inhibitors US Patent US9174974 Publication Date 11/3/2015
 
Coagulation factor VII
Name:Coagulation factor VII
Type:Enzyme
Mol. Mass.:51599.89
Organism:Homo sapiens (Human)
Description:n/a
Residue:466
BDBM189430
NameBDBM189430
Synonyms:US9174974, Example 15
TypeSmall organic molecule
Emp. Form.C34H34FN5O5
Mol. Mass.611.6627
SMILESC[C@H]1COC(=O)Nc2ccc(c(CN(C)C(=O)[C@H](Nc3ccc4c(N)ncc(F)c4c3)c3ccc1c(C)c3)c2)C1(CC1)C(O)=O