Reaction Details
TargetCoagulation factor VII
LigandBDBM189433
Substrate/Competitorn/a
Meas. Tech.In Vitro Assay
Ki 0.44±n/a nM
Citation Zhang, XGlunz, PPriestley, ESJohnson, JAWurtz, NRLadziata, V Macrocyclic factor VIIa inhibitors US Patent US9174974 Publication Date 11/3/2015
 
Coagulation factor VII
Name:Coagulation factor VII
Type:Enzyme
Mol. Mass.:51599.89
Organism:Homo sapiens (Human)
Description:n/a
Residue:466
BDBM189433
NameBDBM189433
Synonyms:US9174974, Example 18
TypeSmall organic molecule
Emp. Form.C35H35FN6O4
Mol. Mass.622.6886
SMILESC[C@H]1COC(=O)Nc2cc(F)c(OCC3(CC3)[N+]#[C-])c(CN(C)C(=O)[C@H](Nc3ccc4c(N)nccc4c3)c3ccc1c(C)c3)c2