Reaction Details
TargetCoagulation factor VII
LigandBDBM189438
Substrate/Competitorn/a
Meas. Tech.In Vitro Assay
Ki 0.3±n/a nM
Citation Zhang, XGlunz, PPriestley, ESJohnson, JAWurtz, NRLadziata, V Macrocyclic factor VIIa inhibitors US Patent US9174974 Publication Date 11/3/2015
 
Coagulation factor VII
Name:Coagulation factor VII
Type:Enzyme
Mol. Mass.:51599.89
Organism:Homo sapiens (Human)
Description:n/a
Residue:466
BDBM189438
NameBDBM189438
Synonyms:US9174974, Example 23
TypeSmall organic molecule
Emp. Form.C37H39N7O4S
Mol. Mass.677.815
SMILESCCN(Cc1nccs1)C(=O)c1ccc2NC(=O)OC[C@H](C)c3ccc(cc3C)[C@@H](Nc3ccc4c(N)nccc4c3)C(=O)N(C)Cc1c2