Reaction Details
TargetCoagulation factor VII
LigandBDBM189439
Substrate/Competitorn/a
Meas. Tech.In Vitro Assay
Ki 0.28±n/a nM
Citation Zhang, XGlunz, PPriestley, ESJohnson, JAWurtz, NRLadziata, V Macrocyclic factor VIIa inhibitors US Patent US9174974 Publication Date 11/3/2015
 
Coagulation factor VII
Name:Coagulation factor VII
Type:Enzyme
Mol. Mass.:51599.89
Organism:Homo sapiens (Human)
Description:n/a
Residue:466
BDBM189439
NameBDBM189439
Synonyms:US9174974, Example 24
TypeSmall organic molecule
Emp. Form.C33H34FN5O5S
Mol. Mass.631.717
SMILESCN1Cc2cc(NC(=O)OC[C@H](CF)c3ccc(cc3C)[C@@H](Nc3ccc4c(N)nccc4c3)C1=O)ccc2S(=O)(=O)C1CC1