Reaction Details
TargetCoagulation factor VII
LigandBDBM189440
Substrate/Competitorn/a
Meas. Tech.In Vitro Assay
Ki 0.25±n/a nM
Citation Zhang, XGlunz, PPriestley, ESJohnson, JAWurtz, NRLadziata, V Macrocyclic factor VIIa inhibitors US Patent US9174974 Publication Date 11/3/2015
 
Coagulation factor VII
Name:Coagulation factor VII
Type:Enzyme
Mol. Mass.:51599.89
Organism:Homo sapiens (Human)
Description:n/a
Residue:466
BDBM189440
NameBDBM189440
Synonyms:US9174974, Example 25
TypeSmall organic molecule
Emp. Form.C33H33F2N5O6S
Mol. Mass.665.707
SMILESCOc1cc2[C@@H](Nc3cc4ccnc(N)c4cc3F)C(=O)N(C)Cc3cc(NC(=O)OC[C@H](C)c1cc2F)ccc3S(=O)(=O)C1CC1