Reaction Details
TargetCoagulation factor VII
LigandBDBM189454
Substrate/Competitorn/a
Meas. Tech.In Vitro Assay
Ki 0.05±n/a nM
Citation Zhang, XGlunz, PPriestley, ESJohnson, JAWurtz, NRLadziata, V Macrocyclic factor VIIa inhibitors US Patent US9174974 Publication Date 11/3/2015
 
Coagulation factor VII
Name:Coagulation factor VII
Type:Enzyme
Mol. Mass.:51599.89
Organism:Homo sapiens (Human)
Description:n/a
Residue:466
BDBM189454
NameBDBM189454
Synonyms:US9174974, Example 38
TypeSmall organic molecule
Emp. Form.C34H36FN5O5
Mol. Mass.613.6785
SMILESC[C@H]1COC(=O)Nc2cc(F)c(O[C@@H]3CCOC3)c(CN(C)C(=O)[C@H](Nc3ccc4c(N)nccc4c3)c3ccc1c(C)c3)c2