Reaction Details
TargetCoagulation factor VII
LigandBDBM189420
Substrate/Competitorn/a
Meas. Tech.In Vitro Assay
pH7.4±n/a
Ki 290±n/a nM
Commentsextracted
Citation Zhang, XGlunz, PPriestley, ESJohnson, JAWurtz, NRLadziata, V Macrocyclic factor VIIa inhibitors US Patent US9174974 Publication Date 11/3/2015
 
Coagulation factor VII
Name:Coagulation factor VII
Type:Enzyme
Mol. Mass.:51599.89
Organism:Homo sapiens (Human)
Description:n/a
Residue:466
BDBM189420
NameBDBM189420
Synonyms:US9174974, Example 5
TypeSmall organic molecule
Emp. Form.C33H33F2N5O5S
Mol. Mass.649.707
SMILESCN1Cc2cc(NC(=O)OCC(F)(F)c3c(C)cc(cc3C)[C@@H](Nc3ccc4c(N)nccc4c3)C1=O)ccc2S(=O)(=O)C1CC1