Reaction Details
TargetCoagulation factor VII
LigandBDBM189423
Substrate/Competitorn/a
Meas. Tech.In Vitro Assay
pH7.4±n/a
Ki 700±n/a nM
Commentsextracted
Citation Zhang, XGlunz, PPriestley, ESJohnson, JAWurtz, NRLadziata, V Macrocyclic factor VIIa inhibitors US Patent US9174974 Publication Date 11/3/2015
 
Coagulation factor VII
Name:Coagulation factor VII
Type:Enzyme
Mol. Mass.:51599.89
Organism:Homo sapiens (Human)
Description:n/a
Residue:466
BDBM189423
NameBDBM189423
Synonyms:US9174974, Example 8
TypeSmall organic molecule
Emp. Form.C33H36FN5O5S
Mol. Mass.633.733
SMILESCC(C)S(=O)(=O)c1ccc2NC(=O)OC[C@H](C)c3ccc(cc3C)[C@@H](Nc3ccc4c(N)ncc(F)c4c3)C(=O)N(C)Cc1c2