Reaction Details
TargetSerine/threonine-protein kinase Sgk1
LigandBDBM50443630
Substrate/Competitorn/a
Meas. Tech.Enzymatic Activity Assay
IC50 2±n/a nM
Citation Nazare, MHalland, NSchmidt, FWeiss, TDietz, UHofmeister, A N-[4-(1H-pyrazolo[3,4-b]pyrazin-6-yl)-phenyl]-sulfonamides and their use as pharmaceuticals US Patent US9174993 Publication Date 11/3/2015
 
Serine/threonine-protein kinase Sgk1
Name:Serine/threonine-protein kinase Sgk1
Type:Other Protein Type
Mol. Mass.:48954.40
Organism:Homo sapiens (Human)
Description:Recombinant human SGK-1 enzyme produced in a baculovirus system.
Residue:431
BDBM50443630
NameBDBM50443630
Synonyms:CHEMBL3092466 US9221828, 15
TypeSmall organic molecule
Emp. Form.C19H16FN5O2S
Mol. Mass.397.426
SMILESCc1n[nH]c2nc(cnc12)-c1ccc(NS(=O)(=O)c2cc(C)ccc2F)cc1