Reaction Details
TargetSodium channel protein type 4 subunit alpha
LigandBDBM60830
Substrate/Competitorn/a
Meas. Tech.Binding Assay
IC50 46±n/a nM
Citation Du Bois, JMulcahy, JAndresen, BYeomans, DCBiswal, S Methods and compositions for studying, imaging, and treating pain US Patent US9174999 Publication Date 11/3/2015
 
Sodium channel protein type 4 subunit alpha
Name:Sodium channel protein type 4 subunit alpha
Type:Enzyme
Mol. Mass.:208810.50
Organism:Rattus norvegicus (Rat)
Description:P15390
Residue:1840
BDBM60830
NameBDBM60830
Synonyms:US9174999, 13
Typen/a
Emp. Form.C30H41N7O6
Mol. Mass.595.6887
SMILESOC1(O)CCCC(=[NH2+])NC(COC(=O)NCCCCCNC(=O)c2ccc(cc2)C(=O)c2ccccc2)C2NC(=[NH2+])NC12