Reaction Details
TargetSodium channel protein type 4 subunit alpha
LigandBDBM190233
Substrate/Competitorn/a
Meas. Tech.Binding Assay
IC50 2.4±n/a nM
Citation Du Bois, JMulcahy, JAndresen, BYeomans, DCBiswal, S Methods and compositions for studying, imaging, and treating pain US Patent US9174999 Publication Date 11/3/2015
 
Sodium channel protein type 4 subunit alpha
Name:Sodium channel protein type 4 subunit alpha
Type:Enzyme
Mol. Mass.:208810.50
Organism:Rattus norvegicus (Rat)
Description:P15390
Residue:1840
BDBM190233
NameBDBM190233
Synonyms:US9174999, Table 1, Compound 1
TypeSmall organic molecule
Emp. Form.C10H17N7O4
Mol. Mass.299.2865
SMILESNC(=O)OC[C@@H]1NC(=N)N2CCC(O)(O)[C@@]22NC(=N)N[C@@H]12