Reaction Details
TargetSodium channel protein type 4 subunit alpha
LigandBDBM190237
Substrate/Competitorn/a
Meas. Tech.Binding Assay
IC50 55±n/a nM
Citation Du Bois, JMulcahy, JAndresen, BYeomans, DCBiswal, S Methods and compositions for studying, imaging, and treating pain US Patent US9174999 Publication Date 11/3/2015
 
Sodium channel protein type 4 subunit alpha
Name:Sodium channel protein type 4 subunit alpha
Type:Enzyme
Mol. Mass.:208810.50
Organism:Rattus norvegicus (Rat)
Description:P15390
Residue:1840
BDBM190237
NameBDBM190237
Synonyms:US9174999, Table 1, Compound 5
TypeSmall organic molecule
Emp. Form.C13H23N7O4
Mol. Mass.341.3662
SMILESCC(C)NC(=O)OC[C@@H]1NC(=N)N2CCC(O)(O)[C@@]22NC(=N)N[C@@H]12