Reaction Details
TargetSodium channel protein type 4 subunit alpha
LigandBDBM190238
Substrate/Competitorn/a
Meas. Tech.Binding Assay
IC50 22.5±n/a nM
Citation Du Bois, JMulcahy, JAndresen, BYeomans, DCBiswal, S Methods and compositions for studying, imaging, and treating pain US Patent US9174999 Publication Date 11/3/2015
 
Sodium channel protein type 4 subunit alpha
Name:Sodium channel protein type 4 subunit alpha
Type:Enzyme
Mol. Mass.:208810.50
Organism:Rattus norvegicus (Rat)
Description:P15390
Residue:1840
BDBM190238
NameBDBM190238
Synonyms:US9174999, Table 1, Compound 6
TypeSmall organic molecule
Emp. Form.C14H23N7O4
Mol. Mass.353.3769
SMILESOC1(O)CCN2C(=N)N[C@@H](COC(=O)N3CCCC3)[C@@H]3NC(=N)N[C@]123