Reaction Details
TargetSodium channel protein type 4 subunit alpha
LigandBDBM190239
Substrate/Competitorn/a
Meas. Tech.Binding Assay
IC50 15±n/a nM
Citation Du Bois, JMulcahy, JAndresen, BYeomans, DCBiswal, S Methods and compositions for studying, imaging, and treating pain US Patent US9174999 Publication Date 11/3/2015
 
Sodium channel protein type 4 subunit alpha
Name:Sodium channel protein type 4 subunit alpha
Type:Enzyme
Mol. Mass.:208810.50
Organism:Rattus norvegicus (Rat)
Description:P15390
Residue:1840
BDBM190239
NameBDBM190239
Synonyms:US9174999, Table 1, Compound 7
TypeSmall organic molecule
Emp. Form.C30H58N9O5
Mol. Mass.624.8383
SMILESCCCCCC[N+](C)(C)CCCCCC(=O)NCCCCCCNC(=O)OC[C@@H]1NC(=N)N2CCC(O)(O)[C@@]22NC(=N)N[C@@H]12