Reaction Details
TargetSodium channel protein type 4 subunit alpha [I757A]
LigandBDBM190235
Substrate/Competitorn/a
Meas. Tech.Binding Assay
IC50 700±n/a nM
Citation Du Bois, JMulcahy, JAndresen, BYeomans, DCBiswal, S Methods and compositions for studying, imaging, and treating pain US Patent US9174999 Publication Date 11/3/2015
 
Sodium channel protein type 4 subunit alpha [I757A]
Name:Sodium channel protein type 4 subunit alpha [I757A]
Type:n/a
Mol. Mass.:208768.42
Organism:Rattus norvegicus (Rat)
Description:P15390 (I757A)
Residue:1840
BDBM190235
NameBDBM190235
Synonyms:US9174999, Table 1, Compound 3 | US9174999, Table 1, Compound 4
TypeSmall organic molecule
Emp. Form.C16H27N7O4
Mol. Mass.381.4301
SMILESOC1(O)CCN2C(=N)N[C@@H](COC(=O)NC3CCCCC3)[C@@H]3NC(=N)N[C@]123