Reaction Details
TargetSodium channel protein type 4 subunit alpha [I757A]
LigandBDBM190237
Substrate/Competitorn/a
Meas. Tech.Binding Assay
IC50 175±n/a nM
Citation Du Bois, JMulcahy, JAndresen, BYeomans, DCBiswal, S Methods and compositions for studying, imaging, and treating pain US Patent US9174999 Publication Date 11/3/2015
 
Sodium channel protein type 4 subunit alpha [I757A]
Name:Sodium channel protein type 4 subunit alpha [I757A]
Type:n/a
Mol. Mass.:208768.42
Organism:Rattus norvegicus (Rat)
Description:P15390 (I757A)
Residue:1840
BDBM190237
NameBDBM190237
Synonyms:US9174999, Table 1, Compound 5
TypeSmall organic molecule
Emp. Form.C13H23N7O4
Mol. Mass.341.3662
SMILESCC(C)NC(=O)OC[C@@H]1NC(=N)N2CCC(O)(O)[C@@]22NC(=N)N[C@@H]12