Reaction Details
TargetSodium channel protein type 4 subunit alpha [M1240A]
LigandBDBM190233
Substrate/Competitorn/a
Meas. Tech.Binding Assay
IC50 90±n/a nM
Citation Du Bois, JMulcahy, JAndresen, BYeomans, DCBiswal, S Methods and compositions for studying, imaging, and treating pain US Patent US9174999 Publication Date 11/3/2015
 
Sodium channel protein type 4 subunit alpha [M1240A]
Name:Sodium channel protein type 4 subunit alpha [M1240A]
Type:n/a
Mol. Mass.:208750.39
Organism:Rattus norvegicus (Rat)
Description:P15390 (M1240A)
Residue:1840
BDBM190233
NameBDBM190233
Synonyms:US9174999, Table 1, Compound 1
TypeSmall organic molecule
Emp. Form.C10H17N7O4
Mol. Mass.299.2865
SMILESNC(=O)OC[C@@H]1NC(=N)N2CCC(O)(O)[C@@]22NC(=N)N[C@@H]12