Reaction Details
TargetSodium channel protein type 4 subunit alpha
LigandBDBM190234
Substrate/Competitorn/a
Meas. Tech.Binding Assay
IC50 26±3 nM
Citation Du Bois, JMulcahy, JAndresen, BYeomans, DCBiswal, S Methods and compositions for studying, imaging, and treating pain US Patent US9174999 Publication Date 11/3/2015
 
Sodium channel protein type 4 subunit alpha
Name:Sodium channel protein type 4 subunit alpha
Type:Enzyme
Mol. Mass.:208810.50
Organism:Rattus norvegicus (Rat)
Description:P15390
Residue:1840
BDBM190234
NameBDBM190234
Synonyms:US9174999, 8
TypeSmall organic molecule
Emp. Form.C17H34N6O4
Mol. Mass.386.4886
SMILESCCCCCCNC(=O)OCC1NC(=[NH2+])CCCC(O)(O)C2NC(=[NH2+])NC12