Reaction Details
TargetSodium channel protein type 4 subunit alpha
LigandBDBM190240
Substrate/Competitorn/a
Meas. Tech.Binding Assay
IC50 83±13 nM
Citation Du Bois, JMulcahy, JAndresen, BYeomans, DCBiswal, S Methods and compositions for studying, imaging, and treating pain US Patent US9174999 Publication Date 11/3/2015
 
Sodium channel protein type 4 subunit alpha
Name:Sodium channel protein type 4 subunit alpha
Type:Enzyme
Mol. Mass.:208810.50
Organism:Rattus norvegicus (Rat)
Description:P15390
Residue:1840
BDBM190240
NameBDBM190240
Synonyms:US9174999, 9
TypeSmall organic molecule
Emp. Form.C14H28N6O4
Mol. Mass.344.4088
SMILESCC(C)NC(=O)OCC1NC(=[NH2+])CCCC(O)(O)C2NC(=[NH2+])NC12