Reaction Details
TargetSodium channel protein type 4 subunit alpha
LigandBDBM190241
Substrate/Competitorn/a
Meas. Tech.Binding Assay
IC50 19±0.8 nM
Citation Du Bois, JMulcahy, JAndresen, BYeomans, DCBiswal, S Methods and compositions for studying, imaging, and treating pain US Patent US9174999 Publication Date 11/3/2015
 
Sodium channel protein type 4 subunit alpha
Name:Sodium channel protein type 4 subunit alpha
Type:Enzyme
Mol. Mass.:208810.50
Organism:Rattus norvegicus (Rat)
Description:P15390
Residue:1840
BDBM190241
NameBDBM190241
Synonyms:US9174999, 10
TypeSmall organic molecule
Emp. Form.C17H36N7O4
Mol. Mass.402.5106
SMILES[NH3+]CCCCCCNC(=O)OCC1NC(=[NH2+])CCCC(O)(O)C2NC(=[NH2+])NC12