Reaction Details
TargetSodium channel protein type 4 subunit alpha
LigandBDBM190242
Substrate/Competitorn/a
Meas. Tech.Binding Assay
IC50 135±7 nM
Citation Du Bois, JMulcahy, JAndresen, BYeomans, DCBiswal, S Methods and compositions for studying, imaging, and treating pain US Patent US9174999 Publication Date 11/3/2015
 
Sodium channel protein type 4 subunit alpha
Name:Sodium channel protein type 4 subunit alpha
Type:Enzyme
Mol. Mass.:208810.50
Organism:Rattus norvegicus (Rat)
Description:P15390
Residue:1840
BDBM190242
NameBDBM190242
Synonyms:US9174999, 11
TypeSmall organic molecule
Emp. Form.C17H31N6O6
Mol. Mass.415.4641
SMILESOC1(O)CCCC(=[NH2+])NC(COC(=O)NCCCCCC([O-])=O)C2NC(=[NH2+])NC12