Reaction Details
TargetVasopressin V1a receptor
LigandBDBM288715
Substrate/Competitorn/a
Meas. Tech.competition binding assay
Temperature298.15±n/a K
Ki 0.398±n/a nM
Commentsextracted
Citation Dolente, CFasching, BRuntz-Schmitt, VSchnider, P Spiro-thiazolones US Patent US10092551 Publication Date 10/9/2018
 
Vasopressin V1a receptor
Name:Vasopressin V1a receptor
Type:Receptor
Mol. Mass.:46820.18
Organism:Homo sapiens (Human)
Description:P37288
Residue:418
BDBM288715
NameBDBM288715
Synonyms:US10092551, Example 23
TypeSmall organic molecule
Emp. Form.C23H20ClFN2O2S
Mol. Mass.442.934
SMILESFC\C(=C1\SC(=NC1=O)N1CCC2(CC1)OCc1ccccc21)c1ccc(Cl)cc1