Reaction Details
TargetArachidonate 15-lipoxygenase
LigandBDBM22873
Substrate/Competitorn/a
Meas. Tech.LoxA HTP Assay
Temperature298.15±n/a K
IC50 1.01e+4± 3.3e+3 nM
Commentsextracted
Citation Deschamps, JDOgunsola, AFJameson, JBYasgar, AFlitter, BAFreedman, CJMelvin, JANguyen, JVMaloney, DJJadhav, ASimeonov, ABomberger, JMHolman, TR Biochemical and Cellular Characterization and Inhibitor Discovery of Pseudomonas aeruginosa 15-Lipoxygenase. Biochemistry55:3329-40 (2016) 
 
Arachidonate 15-lipoxygenase
Name:Arachidonate 15-lipoxygenase
Synonyms:15-Lipoxygenase (LoxA)
Type:Protein
Mol. Mass.:74804.41
Organism:Pseudomonas aeruginosa
Description:n/a
Residue:685
BDBM22873
NameBDBM22873
TypeSmall organic molecule
Emp. Form.C32H39NO2
Mol. Mass.469.6576
SMILESCC(C)(C)c1ccc(cc1)C(=O)CCCN1CCC(CC1)OC(c1ccccc1)c1ccccc1