Reaction Details
TargetArachidonate 15-lipoxygenase
LigandBDBM26948
Substrate/Competitorn/a
Meas. Tech.LoxA HTP Assay
Temperature298.15±n/a K
IC50 4.1e+3± 1.4e+3 nM
Commentsextracted
Citation Deschamps, JDOgunsola, AFJameson, JBYasgar, AFlitter, BAFreedman, CJMelvin, JANguyen, JVMaloney, DJJadhav, ASimeonov, ABomberger, JMHolman, TR Biochemical and Cellular Characterization and Inhibitor Discovery of Pseudomonas aeruginosa 15-Lipoxygenase. Biochemistry55:3329-40 (2016) 
 
Arachidonate 15-lipoxygenase
Name:Arachidonate 15-lipoxygenase
Synonyms:15-Lipoxygenase (LoxA)
Type:Protein
Mol. Mass.:74804.41
Organism:Pseudomonas aeruginosa
Description:n/a
Residue:685
BDBM26948
NameBDBM26948
TypeSmall organic molecule
Emp. Form.C29H31F2N3O
Mol. Mass.475.5727
SMILESFc1ccc(cc1)C(CCCN1CCC2(CC1)N(CNC2=O)c1ccccc1)c1ccc(F)cc1