Reaction Details
TargetArachidonate 15-lipoxygenase
LigandBDBM50092228
Substrate/Competitorn/a
Meas. Tech.LoxA HTP Assay
Temperature298.15±n/a K
IC50 1.62e+4± 3.1e+3 nM
Commentsextracted
Citation Deschamps, JDOgunsola, AFJameson, JBYasgar, AFlitter, BAFreedman, CJMelvin, JANguyen, JVMaloney, DJJadhav, ASimeonov, ABomberger, JMHolman, TR Biochemical and Cellular Characterization and Inhibitor Discovery of Pseudomonas aeruginosa 15-Lipoxygenase. Biochemistry55:3329-40 (2016) 
 
Arachidonate 15-lipoxygenase
Name:Arachidonate 15-lipoxygenase
Synonyms:15-Lipoxygenase (LoxA)
Type:Protein
Mol. Mass.:74804.41
Organism:Pseudomonas aeruginosa
Description:n/a
Residue:685
BDBM50092228
NameBDBM50092228
TypeSmall organic molecule
Emp. Form.C23H22N4O
Mol. Mass.370.447
SMILESNc1ncnc2n(cc(-c3ccc(Oc4ccccc4)cc3)c12)C1CCCC1