Reaction Details
TargetNitric oxide synthase, brain
LigandBDBM190667
Substrate/Competitorn/a
Meas. Tech.Hemoglobin Capture Assay
pH7.4±n/a
Temperature310.15±n/a K
Ki 16.4±0.0 nM
Commentsextracted
Citation Li, HWang, HYKang, SSilverman, RBPoulos, TL Electrostatic Control of Isoform Selective Inhibitor Binding in Nitric Oxide Synthase. Biochemistry55:3702-7 (2016) 
 
Nitric oxide synthase, brain
Name:Nitric oxide synthase, brain
Type:Enzyme
Mol. Mass.:160570.98
Organism:Rattus norvegicus (rat)
Description:Recombinant nNOS overexpressed in E. coli was used in enzyme assays.
Residue:1429
BDBM190667
NameBDBM190667
Synonyms:US10759791, Compound 14j | nNOS inhibitor, 5
TypeSmall organic molecule
Emp. Form.C17H24N4
Mol. Mass.284.3993
SMILESCNCCCc1cncc(CCc2cc(C)cc(N)n2)c1