Reaction Details
TargetNitric oxide synthase, brain [D597N]
LigandBDBM190666
Substrate/Competitorn/a
Meas. Tech.Hemoglobin Capture Assay
pH7.4±n/a
Temperature310.15±n/a K
Ki 641±0.0 nM
Commentsextracted
Citation Li, HWang, HYKang, SSilverman, RBPoulos, TL Electrostatic Control of Isoform Selective Inhibitor Binding in Nitric Oxide Synthase. Biochemistry55:3702-7 (2016) 
 
Nitric oxide synthase, brain [D597N]
Name:Nitric oxide synthase, brain [D597N]
Type:Enzyme
Mol. Mass.:160571.01
Organism:Rattus norvegicus (rat)
Description:Recombinant enzyme overexpressed in E. coli.
Residue:1429
BDBM190666
NameBDBM190666
Synonyms:US10759791, Compound 14h | nNOS inhibitor, 4
TypeSmall organic molecule
Emp. Form.C19H26N4
Mol. Mass.310.4365
SMILESCN1CCC(CC1)c1cncc(CCc2cc(C)cc(N)n2)c1