Reaction Details
TargetAdenosine receptor A3 [I248L]
LigandBDBM191068
Substrate/Competitorn/a
Meas. Tech.Radioligand Binding Assay
pH7.5±n/a
Temperature298.15±n/a K
Ki 6.6±1.6 nM
Commentsextracted
Citation Jacobson, KATosh, DK Adenosine receptor agonists, partial agonists, and antagonists US Patent US9181253 Publication Date 11/10/2015
 
Adenosine receptor A3 [I248L]
Name:Adenosine receptor A3 [I248L]
Type:Protein
Mol. Mass.:36197.32
Organism:Homo sapiens (Human)
Description:P0DMS8[I248L]
Residue:318
BDBM191068
NameBDBM191068
Synonyms:US9181253, 115
TypeSmall organic molecule
Emp. Form.C13H16ClN5O2
Mol. Mass.309.751
SMILESCCNc1nc(Cl)nc2n(cnc12)[C@]12C[C@H]1[C@@H](O)[C@@H](O)C2