Reaction Details
TargetAdenosine receptor A3 [I248L]
LigandBDBM191061
Substrate/Competitorn/a
Meas. Tech.Radioligand Binding Assay
pH7.5±n/a
Temperature298.15±n/a K
Ki 10.3±1.5 nM
Commentsextracted
Citation Jacobson, KATosh, DK Adenosine receptor agonists, partial agonists, and antagonists US Patent US9181253 Publication Date 11/10/2015
 
Adenosine receptor A3 [I248L]
Name:Adenosine receptor A3 [I248L]
Type:Protein
Mol. Mass.:36197.32
Organism:Homo sapiens (Human)
Description:P0DMS8[I248L]
Residue:318
BDBM191061
NameBDBM191061
Synonyms:US9181253, 123
TypeSmall organic molecule
Emp. Form.C20H21ClFN5O3
Mol. Mass.433.864
SMILESO[C@H]1C[C@]2(C[C@H]2[C@H]1O)n1cnc2c(NCc3ccccc3OCCF)nc(Cl)nc12