Reaction Details
TargetAdenosine receptor A3 [I248L]
LigandBDBM191064
Substrate/Competitorn/a
Meas. Tech.Radioligand Binding Assay
pH7.5±n/a
Temperature298.15±n/a K
Ki 16.5±2.8 nM
Commentsextracted
Citation Jacobson, KATosh, DK Adenosine receptor agonists, partial agonists, and antagonists US Patent US9181253 Publication Date 11/10/2015
 
Adenosine receptor A3 [I248L]
Name:Adenosine receptor A3 [I248L]
Type:Protein
Mol. Mass.:36197.32
Organism:Homo sapiens (Human)
Description:P0DMS8[I248L]
Residue:318
BDBM191064
NameBDBM191064
Synonyms:US9181253, 126
TypeSmall organic molecule
Emp. Form.C18H16ClF2N5O2
Mol. Mass.407.802
SMILESO[C@H]1C[C@]2(C[C@H]2[C@H]1O)n1cnc2c(NCc3cc(F)ccc3F)nc(Cl)nc12